Target
Carbonic anhydrase 1
Ligand
BDBM26192
Substrate
Meas. Tech.
ChEMBL_942154 (CHEMBL2341787)
Ki
38810±n/a nM
Citation
 Tuccinardi, TBertini, SGranchi, COrtore, GMacchia, MMinutolo, FMartinelli, ASupuran, CT Salicylaldoxime derivatives as new leads for the development of carbonic anhydrase inhibitors. Bioorg Med Chem 21:1511-5 (2013)  
Target
Name:
Carbonic anhydrase 1
Synonyms:
CA-I CAB Carbonate dehydratase I Carbonic anhydrase 1 (CA I) Carbonic anhydrase 1 (Recombinant CA I) Carbonic anhydrase B Carbonic anhydrase I (CA I) Carbonic anhydrase I (CAI) Carbonic anhydrase isoenzyme I (hCA I) | hCA
Type:
Enzyme
Mol. Mass.:
28873.37
Organism:
Homo sapiens (Human)
Description:
P00915
Residue:
261
  
Inhibitor
Name:
BDBM26192
Synonyms:
3,5-difluorophenol | phenol derivative, 6
Type:
Small organic molecule
Emp. Form.:
C6H4F2O
Mol. Mass.:
130.0922
SMILES:
Oc1cc(F)cc(F)c1
: