Target
Carbonic anhydrase 2
Ligand
BDBM26992
Substrate
Meas. Tech.
ChEMBL_943443 (CHEMBL2341887)
Ki
>300000000±n/a nM
Citation
 Luca, VDVullo, DScozzafava, ACarginale, VRossi, MSupuran, CTCapasso, C Ana-carbonic anhydrase from the thermophilic bacterium Sulphurihydrogenibium azorense is the fastest enzyme known for the CO2 hydration reaction. Bioorg Med Chem 21:1465-9 (2013)  
Target
Name:
Carbonic anhydrase 2
Synonyms:
CA-II CAC Carbonate dehydratase II Carbonic anhydrase 2 (CA-II) Carbonic anhydrase C Carbonic anhydrase II (CA-II) Carbonic anhydrase II (hCA II) | Carbonic anhydrase isoenzyme II (hCA II)
Type:
Enzyme
Mol. Mass.:
29250.71
Organism:
Homo sapiens (Human)
Description:
P00918
Residue:
260
  
Inhibitor
Name:
BDBM26992
Synonyms:
CHEMBL183495 SODIUM SULFATE sulfate ion
Type:
Ion
Emp. Form.:
O4S
Mol. Mass.:
96.064
SMILES:
[O-]S([O-])(=O)=O
: