Target
Carbonic anhydrase 1
Ligand
BDBM50387117
Substrate
Meas. Tech.
ChEMBL_946062 (CHEMBL2342099)
Ki
2155±n/a nM
Citation
 Tarko, LSupuran, CT QSAR studies of sulfamate and sulfamide inhibitors targeting human carbonic anhydrase isozymes I, II, IX and XII. Bioorg Med Chem 21:1404-9 (2013)  
Target
Name:
Carbonic anhydrase 1
Synonyms:
CA-I CAB Carbonate dehydratase I Carbonic anhydrase 1 (CA I) Carbonic anhydrase 1 (Recombinant CA I) Carbonic anhydrase B Carbonic anhydrase I (CA I) Carbonic anhydrase I (CAI) Carbonic anhydrase isoenzyme I (hCA I) | hCA
Type:
Enzyme
Mol. Mass.:
28873.37
Organism:
Homo sapiens (Human)
Description:
P00915
Residue:
261
  
Inhibitor
Name:
BDBM50387117
Synonyms:
4-ureidophenyl sulfamate ring derivative 3g | CHEMBL2047802
Type:
Small organic molecule
Emp. Form.:
C14H15N3O5S
Mol. Mass.:
337.351
SMILES:
COc1ccc(NC(=O)Nc2ccc(OS(N)(=O)=O)cc2)cc1
: