Target
Carbonic anhydrase 12
Ligand
BDBM50387153
Substrate
Meas. Tech.
ChEMBL_946059 (CHEMBL2342096)
Ki
27±n/a nM
Citation
 Tarko, LSupuran, CT QSAR studies of sulfamate and sulfamide inhibitors targeting human carbonic anhydrase isozymes I, II, IX and XII. Bioorg Med Chem 21:1404-9 (2013)  
Target
Name:
Carbonic anhydrase 12
Synonyms:
CA-XII CAH12_HUMAN Carbonic anhydrase Carbonic anhydrase XII Carbonic anhydrase XII (CAXII) | Tumor antigen HOM-RCC-3.1.3
Type:
Enzyme
Mol. Mass.:
39456.00
Organism:
Homo sapiens (Human)
Description:
Catalytic domain of human cloned isozyme was used in the assay
Residue:
354
  
Inhibitor
Name:
BDBM50387153
Synonyms:
CHEMBL2047835
Type:
Small organic molecule
Emp. Form.:
C17H15N3O4S
Mol. Mass.:
357.384
SMILES:
NS(=O)(=O)Oc1ccc(NC(=O)Nc2ccc3ccccc3c2)cc1
: