Target
NUAK family SNF1-like kinase 1
Ligand
BDBM50428738
Substrate
Meas. Tech.
ChEMBL_947948 (CHEMBL2344169)
IC50
1700±n/a nM
Citation
 Niemann, HLin, WMüller, WEKubbutat, MLai, DProksch, P Trimeric hemibastadin congener from the marine sponge Ianthella basta. J Nat Prod 76:121-5 (2013)  
Target
Name:
NUAK family SNF1-like kinase 1
Synonyms:
ARK5 NUAK1 OMPHK1
Type:
PROTEIN
Mol. Mass.:
74326.51
Organism:
Homo sapiens (Human)
Description:
ChEMBL_1451343
Residue:
661
  
Inhibitor
Name:
BDBM50428738
Synonyms:
CHEMBL2333163 | Sesquibastadin 1
Type:
Small organic molecule
Emp. Form.:
C51H44Br6N6O12
Mol. Mass.:
1412.352
SMILES:
Oc1ccc(CCNC(=O)C(Cc2cc(Br)c(O)c(Oc3ccc(CCNC(=O)C(Cc4cc(Br)c(O)c(c4)-c4cc(CC(N=O)C(=O)NCCc5ccc(O)c(Br)c5)cc(Br)c4O)N=O)cc3Br)c2)N=O)cc1Br
: