Target
Stromelysin-1
Ligand
BDBM50161331
Substrate
Meas. Tech.
ChEMBL_944582 (CHEMBL2339487)
IC50
4500±n/a nM
Citation
 Jain, PSaravanan, CSingh, SK Sulphonamides: Deserving class as MMP inhibitors? Eur J Med Chem 60:89-100 (2013)  
Target
Name:
Stromelysin-1
Synonyms:
MMP-3 MMP3_HUMAN Matrix metalloproteinase 3 Matrix metalloproteinase-3 (MMP-3) SL-1 Stromelysin 1 | Transin-1
Type:
Enzyme
Mol. Mass.:
53973.13
Organism:
Homo sapiens (Human)
Description:
P08254
Residue:
477
  
Inhibitor
Name:
BDBM50161331
Synonyms:
2-[(Biphenyl-4-sulfonyl)-isopropoxy-amino]-N-hydroxy-acetamide N-hydroxy-2-(N-isopropoxybiphenyl-4-ylsulfonamido)acetamide
Type:
Small organic molecule
Emp. Form.:
C17H20N2O5S
Mol. Mass.:
364.416
SMILES:
CC(C)ON(CC(=O)NO)S(=O)(=O)c1ccc(cc1)-c1ccccc1
: