Target
Carbonic anhydrase 1
Ligand
BDBM50428841
Substrate
Meas. Tech.
ChEMBL_944596 (CHEMBL2339501)
Ki
26±n/a nM
Citation
 Alafeefy, AMIsik, SAbdel-Aziz, HAAshour, AEVullo, DAl-Jaber, NASupuran, CT Carbonic anhydrase inhibitors: benzenesulfonamides incorporating cyanoacrylamide moieties are low nanomolar/subnanomolar inhibitors of the tumor-associated isoforms IX and XII. Bioorg Med Chem 21:1396-403 (2013)  
Target
Name:
Carbonic anhydrase 1
Synonyms:
CA-I CAB Carbonate dehydratase I Carbonic anhydrase 1 (CA I) Carbonic anhydrase 1 (Recombinant CA I) Carbonic anhydrase B Carbonic anhydrase I (CA I) Carbonic anhydrase I (CAI) Carbonic anhydrase isoenzyme I (hCA I) | hCA
Type:
Enzyme
Mol. Mass.:
28873.37
Organism:
Homo sapiens (Human)
Description:
P00915
Residue:
261
  
Inhibitor
Name:
BDBM50428841
Synonyms:
CHEMBL2337134
Type:
Small organic molecule
Emp. Form.:
C19H19N3O6S
Mol. Mass.:
417.436
SMILES:
COc1cc(OC)c(\C=C(/C#N)C(=O)Nc2ccc(cc2)S(N)(=O)=O)c(OC)c1
: