Target
NAD-dependent protein deacetylase sirtuin-2
Ligand
BDBM31963
Substrate
Meas. Tech.
ChEMBL_948494 (CHEMBL2343195)
EC50
16500±n/a nM
Citation
 Wu, JZhang, DChen, LLi, JWang, JNing, CYu, NZhao, FChen, DChen, XChen, KJiang, HLiu, HLiu, D Discovery and mechanism study of SIRT1 activators that promote the deacetylation of fluorophore-labeled substrate. J Med Chem 56:761-80 (2013)  
Target
Name:
NAD-dependent protein deacetylase sirtuin-2
Synonyms:
NAD-Dependent Deacetylase Sirtuin-2 NAD-dependent deacetylase sirtuin 3 SIR2-like SIR2L SIR2_HUMAN Sirtuin 2 (SIRT2)
Type:
Hydrolase
Mol. Mass.:
43172.62
Organism:
Homo sapiens (Human)
Description:
Residue:
389
  
Inhibitor
Name:
BDBM31963
Synonyms:
carbohydrazide derivative, 5f
Type:
Small organic molecule
Emp. Form.:
C21H14Br2N2O3
Mol. Mass.:
502.155
SMILES:
Oc1c(Br)cc(C=NNC(=O)c2ccc-3c(Cc4ccccc-34)c2)c(O)c1Br
: