Target
Cytochrome P450 3A4
Ligand
BDBM50429008
Substrate
Meas. Tech.
ChEMBL_948527 (CHEMBL2343700)
IC50
5000±n/a nM
Citation
 Ting, PCLee, JFZorn, NKim, HMAslanian, RGLin, MSmith, MWalker, SSCook, JVan Heek, MLachowicz, J Lead optimization of a pyridine-carboxamide series as DGAT-1 inhibitors. Bioorg Med Chem Lett 23:985-8 (2013)  
Target
Name:
Cytochrome P450 3A4
Synonyms:
Albendazole monooxygenase CP3A4_HUMAN CYP3A4 CYPIIIA4 Cytochrome P450 3A4 (CYP3A4) Nifedipine oxidase Taurochenodeoxycholate 6-alpha-hydroxylase
Type:
Enzyme
Mol. Mass.:
57349.57
Organism:
Homo sapiens (Human)
Description:
Residue:
503
  
Inhibitor
Name:
BDBM50429008
Synonyms:
CHEMBL2334082
Type:
Small organic molecule
Emp. Form.:
C31H29N3O5
Mol. Mass.:
523.5791
SMILES:
OC(=O)c1cccc(OCC2CCN(CC2)c2ccc(NC(=O)c3cccc(Oc4ccccc4)c3)cn2)c1
: