Target
Diacylglycerol O-acyltransferase 1
Ligand
BDBM50429011
Substrate
Meas. Tech.
ChEMBL_948536 (CHEMBL2343709)
IC50
149±n/a nM
Citation
 Ting, PCLee, JFZorn, NKim, HMAslanian, RGLin, MSmith, MWalker, SSCook, JVan Heek, MLachowicz, J Lead optimization of a pyridine-carboxamide series as DGAT-1 inhibitors. Bioorg Med Chem Lett 23:985-8 (2013)  
Target
Name:
Diacylglycerol O-acyltransferase 1
Synonyms:
ACAT-related gene product 1 Acyl coA-diacylglycerol acyl transferase 1 (DGAT1) DGAT1 Diacylglycerol Acyltransferase (DGAT1) Diacylglycerol O-acyltransferase 1 (DGAT1) | Diglyceride acyltransferase
Type:
Protein
Mol. Mass.:
55297.82
Organism:
Homo sapiens (Human)
Description:
O75907
Residue:
488
  
Inhibitor
Name:
BDBM50429011
Synonyms:
CHEMBL2334084
Type:
Small organic molecule
Emp. Form.:
C32H31N3O5
Mol. Mass.:
537.6056
SMILES:
OC(=O)c1cccc(OCC2CCN(CC2)c2ccc(NC(=O)c3ccc(OCc4ccccc4)cc3)cn2)c1
: