Target
G-protein coupled bile acid receptor 1
Ligand
BDBM50429126
Substrate
Meas. Tech.
ChEMBL_943574 (CHEMBL2343387)
EC50
49±n/a nM
Citation
 Londregan, ATPiotrowski, DWFutatsugi, KWarmus, JSBoehm, MCarpino, PAChin, JEJanssen, AMRoush, NSBuxton, JHinchey, T Discovery of 5-phenoxy-1,3-dimethyl-1H-pyrazole-4-carboxamides as potent agonists of TGR5 via sequential combinatorial libraries. Bioorg Med Chem Lett 23:1407-11 (2013)  
Target
Name:
G-protein coupled bile acid receptor 1
Synonyms:
BG37 GPBAR_HUMAN TGR5 hGPCR19
Type:
G Protein-Coupled Receptor (GPCR)
Mol. Mass.:
35260.02
Organism:
Homo sapiens (Human)
Description:
CHO cells transiently transfected with hTGR5.
Residue:
330
  
Inhibitor
Name:
BDBM50429126
Synonyms:
CHEMBL2336233
Type:
Small organic molecule
Emp. Form.:
C22H24Cl2N4O2
Mol. Mass.:
447.358
SMILES:
CC(C)N(Cc1ccc(C)nc1)C(=O)c1c(C)nn(C)c1Oc1cccc(Cl)c1Cl
: