Target
11-beta-hydroxysteroid dehydrogenase 1
Ligand
BDBM50429305
Substrate
Meas. Tech.
ChEMBL_947108 (CHEMBL2340613)
IC50
>1000±n/a nM
Citation
 Xia, GYou, XLiu, LLiu, HWang, JShi, YLi, PXiong, BLiu, XShen, J Design, synthesis and SAR of piperidyl-oxadiazoles as 11ß-hydroxysteroid dehydrogenase 1 inhibitors. Eur J Med Chem 62:1-10 (2013)  
Target
Name:
11-beta-hydroxysteroid dehydrogenase 1
Synonyms:
11-DH 11-beta-Hydroxysteroid Dehydrogenase 1 (11-beta-HSD1) 11-beta-hydroxysteroid dehydrogenase 1 (11HSD1) Corticosteroid 11-beta-dehydrogenase isozyme 1 (11-beta-HSD-1) Corticosteroid 11-beta-dehydrogenase isozyme 1 (11beta-HSD1) HSD11 HSD11L | SDR26C1
Type:
Enzyme
Mol. Mass.:
32409.16
Organism:
Homo sapiens (Human)
Description:
P28845
Residue:
292
  
Inhibitor
Name:
BDBM50429305
Synonyms:
CHEMBL2334152
Type:
Small organic molecule
Emp. Form.:
C25H30ClN3O2
Mol. Mass.:
439.978
SMILES:
Cc1c(Cl)cccc1C(=O)N1CCC[C@@H](C1)c1nc(no1)C12CC3CC(CC(C3)C1)C2
: