Target
Polyunsaturated fatty acid 5-lipoxygenase
Ligand
BDBM50429361
Substrate
Meas. Tech.
ChEMBL_948575 (CHEMBL2344231)
IC50
189±n/a nM
Citation
 Meirer, KRödl, CBWisniewska, JMGeorge, SHäfner, AKBuscató, ELKlingler, FMHahn, SBerressem, DWittmann, SKSteinhilber, DHofmann, BProschak, E Synthesis and structure-activity relationship studies of novel dual inhibitors of soluble epoxide hydrolase and 5-lipoxygenase. J Med Chem 56:1777-81 (2013)  
Target
Name:
Polyunsaturated fatty acid 5-lipoxygenase
Synonyms:
5-LO 5-Lipoxygenase (5-LO) 5-Lipoygenase ALOX5 LOG5 | LOX5_HUMAN
Type:
Enzyme
Mol. Mass.:
77972.74
Organism:
Homo sapiens (Human)
Description:
Recombinant protein was purified from E. coli lysate. After ammonium sulfate precipitation and subsequent steps, the supernatant (S100) was used for 5-LO activity assay.
Residue:
674
  
Inhibitor
Name:
BDBM50429361
Synonyms:
CHEMBL2336301
Type:
Small organic molecule
Emp. Form.:
C35H47N5O3
Mol. Mass.:
585.7794
SMILES:
COc1cc(ccc1OCCCNC(=O)NC12CC3CC(CC(C3)C1)C2)-c1nc2ccc(C)cn2c1NC1CCCCC1
: