Target
Bifunctional epoxide hydrolase 2
Ligand
BDBM50429373
Substrate
Meas. Tech.
ChEMBL_948576 (CHEMBL2344666)
IC50
52±n/a nM
Citation
 Meirer, KRödl, CBWisniewska, JMGeorge, SHäfner, AKBuscató, ELKlingler, FMHahn, SBerressem, DWittmann, SKSteinhilber, DHofmann, BProschak, E Synthesis and structure-activity relationship studies of novel dual inhibitors of soluble epoxide hydrolase and 5-lipoxygenase. J Med Chem 56:1777-81 (2013)  
Target
Name:
Bifunctional epoxide hydrolase 2
Synonyms:
Cytosolic epoxide hydrolase 2 EPHX2 HYES_HUMAN Soluble epoxide hydrolase (sEH) | epoxide hydrolase 2, cytoplasmic
Type:
Enzyme
Mol. Mass.:
62613.07
Organism:
Homo sapiens (Human)
Description:
P34913
Residue:
555
  
Inhibitor
Name:
BDBM50429373
Synonyms:
CHEMBL2336309
Type:
Small organic molecule
Emp. Form.:
C31H33F4N5O3
Mol. Mass.:
599.619
SMILES:
COc1cc(ccc1OCCCNC(=O)Nc1ccc(cc1)C(F)(F)F)-c1nc2ccc(F)cn2c1NC1CCCCC1
: