Target
Bifunctional epoxide hydrolase 2
Ligand
BDBM50429376
Substrate
Meas. Tech.
ChEMBL_948576 (CHEMBL2344666)
IC50
32±n/a nM
Citation
 Meirer, KRödl, CBWisniewska, JMGeorge, SHäfner, AKBuscató, ELKlingler, FMHahn, SBerressem, DWittmann, SKSteinhilber, DHofmann, BProschak, E Synthesis and structure-activity relationship studies of novel dual inhibitors of soluble epoxide hydrolase and 5-lipoxygenase. J Med Chem 56:1777-81 (2013)  
Target
Name:
Bifunctional epoxide hydrolase 2
Synonyms:
Cytosolic epoxide hydrolase 2 EPHX2 HYES_HUMAN Soluble epoxide hydrolase (sEH) | epoxide hydrolase 2, cytoplasmic
Type:
Enzyme
Mol. Mass.:
62613.07
Organism:
Homo sapiens (Human)
Description:
P34913
Residue:
555
  
Inhibitor
Name:
BDBM50429376
Synonyms:
CHEMBL2336306
Type:
Small organic molecule
Emp. Form.:
C31H33ClF3N5O4
Mol. Mass.:
632.073
SMILES:
COc1cc(ccc1OCCCNC(=O)Nc1ccc(OC(F)(F)F)cc1)-c1nc2ccc(Cl)cn2c1NC1CCCCC1
: