Target
Serine/threonine-protein kinase PLK1
Ligand
BDBM50429477
Substrate
Meas. Tech.
ChEMBL_943667 (CHEMBL2344398)
IC50
>10000±n/a nM
Citation
 Yang, LLLi, GBMa, SZou, CZhou, SSun, QZCheng, CChen, XWang, LJFeng, SLi, LLYang, SY Structure-activity relationship studies of pyrazolo[3,4-d]pyrimidine derivatives leading to the discovery of a novel multikinase inhibitor that potently inhibits FLT3 and VEGFR2 and evaluation of its activity against acute myeloid leukemia in vitro and in vivo. J Med Chem 56:1641-55 (2013)  
Target
Name:
Serine/threonine-protein kinase PLK1
Synonyms:
PLK PLK1 Polo-like kinase 1 (PlK1) STPK13 Serine/threonine-protein kinase 13 | polo-like kinase
Type:
Serine/threonine-protein kinase
Mol. Mass.:
68277.16
Organism:
Homo sapiens (Human)
Description:
P53350
Residue:
603
  
Inhibitor
Name:
BDBM50429477
Synonyms:
CHEMBL2332840
Type:
Small organic molecule
Emp. Form.:
C19H12ClF3N6O2
Mol. Mass.:
448.786
SMILES:
FC(F)(F)c1cc(NC(=O)Nc2ccc(Oc3ncnc4n[nH]cc34)cc2)ccc1Cl
: