Target
Platelet-derived growth factor receptor alpha
Ligand
BDBM50429477
Substrate
Meas. Tech.
ChEMBL_943678 (CHEMBL2344409)
IC50
223±n/a nM
Citation
 Yang, LLLi, GBMa, SZou, CZhou, SSun, QZCheng, CChen, XWang, LJFeng, SLi, LLYang, SY Structure-activity relationship studies of pyrazolo[3,4-d]pyrimidine derivatives leading to the discovery of a novel multikinase inhibitor that potently inhibits FLT3 and VEGFR2 and evaluation of its activity against acute myeloid leukemia in vitro and in vivo. J Med Chem 56:1641-55 (2013)  
Target
Name:
Platelet-derived growth factor receptor alpha
Synonyms:
Alpha-type platelet-derived growth factor receptor PDGFRA PGFRA_HUMAN Platelet-derived growth factor receptor alpha (PDGFRA) RHEPDGFRA
Type:
Protein
Mol. Mass.:
122633.38
Organism:
Homo sapiens (Human)
Description:
P16234
Residue:
1089
  
Inhibitor
Name:
BDBM50429477
Synonyms:
CHEMBL2332840
Type:
Small organic molecule
Emp. Form.:
C19H12ClF3N6O2
Mol. Mass.:
448.786
SMILES:
FC(F)(F)c1cc(NC(=O)Nc2ccc(Oc3ncnc4n[nH]cc34)cc2)ccc1Cl
: