Target
Histone deacetylase 4
Ligand
BDBM50015112
Substrate
Meas. Tech.
ChEMBL_944721 (CHEMBL2340967)
Temperature
298.15±n/a K
IC50
>33330±n/a nM
Comments
extracted
Citation
 Wagner, FFOlson, DEGale, JPKaya, TWeïwer, MAidoud, NThomas, MDavoine, ELLemercier, BCZhang, YLHolson, EB Potent and selective inhibition of histone deacetylase 6 (HDAC6) does not require a surface-binding motif. J Med Chem 56:1772-6 (2013)  
Target
Name:
Histone deacetylase 4
Synonyms:
Cereblon/Histone deacetylase 4 HDAC4 Histone acetylase 4(HDAC4) KIAA0288
Type:
Enzyme
Mol. Mass.:
119049.39
Organism:
Homo sapiens (Human)
Description:
P56524
Residue:
1084
  
Inhibitor
Name:
BDBM50015112
Synonyms:
CHEMBL152162 N-hydroxy-3-phenylpropionamide
Type:
Small organic molecule
Emp. Form.:
C9H11NO2
Mol. Mass.:
165.1891
SMILES:
ONC(=O)CCc1ccccc1
: