Target
Histone deacetylase 2
Ligand
BDBM50429531
Substrate
Meas. Tech.
ChEMBL_944722 (CHEMBL2340968)
Temperature
298.15±n/a K
IC50
607±n/a nM
Comments
extracted
Citation
 Wagner, FFOlson, DEGale, JPKaya, TWeïwer, MAidoud, NThomas, MDavoine, ELLemercier, BCZhang, YLHolson, EB Potent and selective inhibition of histone deacetylase 6 (HDAC6) does not require a surface-binding motif. J Med Chem 56:1772-6 (2013)  
Target
Name:
Histone deacetylase 2
Synonyms:
Cereblon/Histone deacetylase 2 HDAC2 Histone deacetylase 2 (HDAC2) | Human HDAC2
Type:
Chromatin regulator; hydrolase; repressor
Mol. Mass.:
55356.54
Organism:
Homo sapiens (Human)
Description:
Q92769
Residue:
488
  
Inhibitor
Name:
BDBM50429531
Synonyms:
CHEMBL2333340
Type:
Small organic molecule
Emp. Form.:
C16H16N2O3
Mol. Mass.:
284.3098
SMILES:
ONC(=O)c1ccc(cc1)C(=O)NCCc1ccccc1
: