Target
Histone deacetylase 8
Ligand
BDBM50015112
Substrate
Meas. Tech.
ChEMBL_944719 (CHEMBL2340965)
Temperature
298.15±n/a K
IC50
2350±n/a nM
Comments
extracted
Citation
 Wagner, FFOlson, DEGale, JPKaya, TWeïwer, MAidoud, NThomas, MDavoine, ELLemercier, BCZhang, YLHolson, EB Potent and selective inhibition of histone deacetylase 6 (HDAC6) does not require a surface-binding motif. J Med Chem 56:1772-6 (2013)  
Target
Name:
Histone deacetylase 8
Synonyms:
HD8 HDAC8_HUMAN Histone deacetylase 8 (HDAC-8) | Human HDAC8
Type:
Enzyme
Mol. Mass.:
41749.60
Organism:
Homo sapiens (Human)
Description:
Q9BY41
Residue:
377
  
Inhibitor
Name:
BDBM50015112
Synonyms:
CHEMBL152162 N-hydroxy-3-phenylpropionamide
Type:
Small organic molecule
Emp. Form.:
C9H11NO2
Mol. Mass.:
165.1891
SMILES:
ONC(=O)CCc1ccccc1
: