Target
Histone deacetylase 5
Ligand
BDBM50015184
Substrate
Meas. Tech.
ChEMBL_944712 (CHEMBL2340958)
Temperature
298.15±n/a K
IC50
>33330±n/a nM
Comments
extracted
Citation
 Wagner, FFOlson, DEGale, JPKaya, TWeïwer, MAidoud, NThomas, MDavoine, ELLemercier, BCZhang, YLHolson, EB Potent and selective inhibition of histone deacetylase 6 (HDAC6) does not require a surface-binding motif. J Med Chem 56:1772-6 (2013)  
Target
Name:
Histone deacetylase 5
Synonyms:
Antigen NY-CO-9 HDAC5 Histone acetylase 5 (HDAC5) Human HDAC5 | KIAA0600
Type:
Enzyme
Mol. Mass.:
121968.61
Organism:
Homo sapiens (Human)
Description:
Q9UQL6
Residue:
1122
  
Inhibitor
Name:
BDBM50015184
Synonyms:
BENZHYDROXAMIC ACID CHEMBL16300 N-hydroxybenzamide | benzoyl hydroxamic acid
Type:
Small organic molecule
Emp. Form.:
C7H7NO2
Mol. Mass.:
137.136
SMILES:
ONC(=O)c1ccccc1
: