Target
Sterol O-acyltransferase 2
Ligand
BDBM50429575
Substrate
Meas. Tech.
ChEMBL_945256 (CHEMBL2339988)
IC50
6.1±n/a nM
Citation
 Ohtawa, MYamazaki, HOhte, SMatsuda, DOhshiro, TRudel, LLOmura, STomoda, HNagamitsu, T Synthesis and structure-activity relationship of pyripyropene A derivatives as potent and selective acyl-CoA:cholesterol acyltransferase 2 (ACAT2) inhibitors: part 1. Bioorg Med Chem Lett 23:1285-7 (2013)  
Target
Name:
Sterol O-acyltransferase 2
Synonyms:
ACACT2 ACAT2 Acetyl-CoA transferase-like protein Cholesterol acyltransferase 2 SOAT2 | SOAT2_HUMAN
Type:
Enzyme
Mol. Mass.:
59912.75
Organism:
Homo sapiens (Human)
Description:
O75908
Residue:
522
  
Inhibitor
Name:
BDBM50429575
Synonyms:
CHEMBL2334214
Type:
Small organic molecule
Emp. Form.:
C37H40FNO11
Mol. Mass.:
693.712
SMILES:
COc1ccc(cc1F)C(=O)O[C@H]1C[C@H]2[C@](C)(COC(C)=O)[C@H](CC[C@]2(C)[C@H]2[C@@H](O)c3c(O[C@]12C)cc(oc3=O)-c1cccnc1)OC(C)=O
: