Target
Mitogen-activated protein kinase kinase kinase 14
Ligand
BDBM7641
Substrate
Meas. Tech.
ChEMBL_945747 (CHEMBL2346384)
IC50
>80000±n/a nM
Citation
 Li, KMcGee, LRFisher, BSudom, ALiu, JRubenstein, SMAnwer, MKCushing, TDShin, YAyres, MLee, FEksterowicz, JFaulder, PWaszkowycz, BPlotnikova, OFarrelly, EXiao, SHChen, GWang, Z Inhibiting NF-¿B-inducing kinase (NIK): discovery, structure-based design, synthesis, structure-activity relationship, and co-crystal structures. Bioorg Med Chem Lett 23:1238-44 (2013)  
Target
Name:
Mitogen-activated protein kinase kinase kinase 14
Synonyms:
HsNIK MAP3K14 NF-kappa-beta-inducing kinase (NF-kB) Serine/threonine-protein kinase NIK
Type:
Protein
Mol. Mass.:
104059.50
Organism:
Homo sapiens (Human)
Description:
Q99558
Residue:
947
  
Inhibitor
Name:
BDBM7641
Synonyms:
4-{2-methylimidazo[1,2-a]pyridin-3-yl}pyrimidin-2-amine | Imidazo[1,2-a]pyridine deriv. 1
Type:
Small organic molecule
Emp. Form.:
C12H11N5
Mol. Mass.:
225.2492
SMILES:
Cc1nc2ccccn2c1-c1ccnc(N)n1
: