Target
A disintegrin and metalloproteinase with thrombospondin motifs 5
Ligand
BDBM50429818
Substrate
Meas. Tech.
ChEMBL_948650 (CHEMBL2345166)
Ki
21000±n/a nM
Citation
 Nuti, ESantamaria, SCasalini, FYamamoto, KMarinelli, LLa Pietra, VNovellino, EOrlandini, ENencetti, SMarini, AMSalerno, STaliani, SDa Settimo, FNagase, HRossello, A Arylsulfonamide inhibitors of aggrecanases as potential therapeutic agents for osteoarthritis: synthesis and biological evaluation. Eur J Med Chem 62:379-94 (2013)  
Target
Name:
A disintegrin and metalloproteinase with thrombospondin motifs 5
Synonyms:
A disintegrin and metalloproteinase with thrombospondin motifs 5 (ADAMTS-5) ADAMTS5 ATS5_HUMAN Metalloproteinase with thrombospondin motifs 5 (ADAMTS-5)
Type:
Enzyme
Mol. Mass.:
101769.09
Organism:
Homo sapiens (Human)
Description:
Q9UNA0
Residue:
930
  
Inhibitor
Name:
BDBM50429818
Synonyms:
CHEMBL2337691
Type:
Small organic molecule
Emp. Form.:
C15H16N2O5S
Mol. Mass.:
336.363
SMILES:
ONC(=O)CNS(=O)(=O)c1ccc(OCc2ccccc2)cc1
: