Target
Serine/threonine-protein kinase N2
Ligand
BDBM50429867
Substrate
Meas. Tech.
ChEMBL_943768 (CHEMBL2345781)
IC50
>10000±n/a nM
Citation
 Takeuchi, CSKim, BGBlazey, CMMa, SJohnson, HWAnand, NKArcalas, ABaik, TGBuhr, CACannoy, JEpshteyn, SJoshi, ALara, KLee, MSWang, LLeahy, JWNuss, JMAay, NAoyama, RFoster, PLee, JLehoux, IMunagala, NPlonowski, ARajan, SWoolfrey, JYamaguchi, KLamb, PMiller, N Discovery of a novel class of highly potent, selective, ATP-competitive, and orally bioavailable inhibitors of the mammalian target of rapamycin (mTOR). J Med Chem 56:2218-34 (2013)  
Target
Name:
Serine/threonine-protein kinase N2
Synonyms:
PKN2 PRK2 Protein kinase C-like 2 Protein-kinase C-related kinase 2 | Serine/threonine-protein kinase N2
Type:
PROTEIN
Mol. Mass.:
112029.78
Organism:
Homo sapiens (Human)
Description:
ChEMBL_1433151
Residue:
984
  
Inhibitor
Name:
BDBM50429867
Synonyms:
CHEMBL2333365
Type:
Small organic molecule
Emp. Form.:
C23H22FN3O4S
Mol. Mass.:
455.502
SMILES:
Cc1c(F)c(ccc1C(=O)N1CCOc2ccc(cc2C1)-c1ccc(N)nc1)S(C)(=O)=O
: