Target
Lysophosphatidic acid receptor 1
Ligand
BDBM50430007
Substrate
Meas. Tech.
ChEMBL_946259 (CHEMBL2344997)
EC50
12±n/a nM
Citation
 Jiang, GInoue, AAoki, JPrestwich, GD Phosphorothioate analogs of sn-2 radyl lysophosphatidic acid (LPA): metabolically stabilized LPA receptor agonists. Bioorg Med Chem Lett 23:1865-9 (2013)  
Target
Name:
Lysophosphatidic acid receptor 1
Synonyms:
EDG2 LPA-1 LPAR1 Lysophosphatidic acid receptor 1 (LPA1) | Lysophosphatidic acid receptor Edg-2
Type:
Enzyme
Mol. Mass.:
41120.55
Organism:
Homo sapiens (Human)
Description:
Q92633
Residue:
364
  
Inhibitor
Name:
BDBM50430007
Synonyms:
CHEMBL2335051
Type:
Small organic molecule
Emp. Form.:
C22H44O6PS
Mol. Mass.:
467.62
SMILES:
CCCCCCCCCCCCCCCCCC(=O)OC(COC)COP(O)([O-])=S
: