Target
Carbonic anhydrase 1
Ligand
BDBM50278318
Substrate
Meas. Tech.
ChEMBL_943322 (CHEMBL2340378)
Ki
110000±n/a nM
Citation
 Vullo, DIsik, SDel Prete, SDe Luca, VCarginale, VScozzafava, ASupuran, CTCapasso, C Anion inhibition studies of thea-carbonic anhydrase from the pathogenic bacterium Vibrio cholerae. Bioorg Med Chem Lett 23:1636-8 (2013)  
Target
Name:
Carbonic anhydrase 1
Synonyms:
CA-I CAB Carbonate dehydratase I Carbonic anhydrase 1 (CA I) Carbonic anhydrase 1 (Recombinant CA I) Carbonic anhydrase B Carbonic anhydrase I (CA I) Carbonic anhydrase I (CAI) Carbonic anhydrase isoenzyme I (hCA I) | hCA
Type:
Enzyme
Mol. Mass.:
28873.37
Organism:
Homo sapiens (Human)
Description:
P00915
Residue:
261
  
Inhibitor
Name:
BDBM50278318
Synonyms:
CHEMBL444819 | sodium perrhenate(VII)
Type:
Small organic molecule
Emp. Form.:
O4Re
Mol. Mass.:
250.205
SMILES:
[O-][Re](=O)(=O)=O
: