Target
Carbonic anhydrase 1
Ligand
BDBM50333131
Substrate
Meas. Tech.
ChEMBL_943322 (CHEMBL2340378)
Ki
540000±n/a nM
Citation
 Vullo, DIsik, SDel Prete, SDe Luca, VCarginale, VScozzafava, ASupuran, CTCapasso, C Anion inhibition studies of thea-carbonic anhydrase from the pathogenic bacterium Vibrio cholerae. Bioorg Med Chem Lett 23:1636-8 (2013)  
Target
Name:
Carbonic anhydrase 1
Synonyms:
CA-I CAB Carbonate dehydratase I Carbonic anhydrase 1 (CA I) Carbonic anhydrase 1 (Recombinant CA I) Carbonic anhydrase B Carbonic anhydrase I (CA I) Carbonic anhydrase I (CAI) Carbonic anhydrase isoenzyme I (hCA I) | hCA
Type:
Enzyme
Mol. Mass.:
28873.37
Organism:
Homo sapiens (Human)
Description:
P00915
Residue:
261
  
Inhibitor
Name:
BDBM50333131
Synonyms:
CHEMBL1075630 tetrasodium {[dioxido(oxo)vanadio]oxy}(oxo)vanadiumbis(olate)
Type:
Small organic molecule
Emp. Form.:
O7V2
Mol. Mass.:
213.881
SMILES:
[O-][V]([O-])(=O)O[V]([O-])([O-])=O
: