Target
Carbonic anhydrase 2
Ligand
BDBM50278323
Substrate
Meas. Tech.
ChEMBL_943321 (CHEMBL2340377)
Ki
8800±n/a nM
Citation
 Vullo, DIsik, SDel Prete, SDe Luca, VCarginale, VScozzafava, ASupuran, CTCapasso, C Anion inhibition studies of thea-carbonic anhydrase from the pathogenic bacterium Vibrio cholerae. Bioorg Med Chem Lett 23:1636-8 (2013)  
Target
Name:
Carbonic anhydrase 2
Synonyms:
CA-II CAC Carbonate dehydratase II Carbonic anhydrase 2 (CA-II) Carbonic anhydrase C Carbonic anhydrase II (CA-II) Carbonic anhydrase II (hCA II) | Carbonic anhydrase isoenzyme II (hCA II)
Type:
Enzyme
Mol. Mass.:
29250.71
Organism:
Homo sapiens (Human)
Description:
P00918
Residue:
260
  
Inhibitor
Name:
BDBM50278323
Synonyms:
CHEMBL471245 | sodium trithiocarbonate
Type:
Small organic molecule
Emp. Form.:
CS3
Mol. Mass.:
108.207
SMILES:
[S-]C([S-])=S
: