Target
Neuronal acetylcholine receptor subunit alpha-7
Ligand
BDBM50430247
Substrate
Meas. Tech.
ChEMBL_943353 (CHEMBL2340861)
EC50
110±n/a nM
Citation
 McDonald, IMMate, RAZusi, FCHuang, HPost-Munson, DJFerrante, MAGallagher, LBertekap, RLKnox, RJRobertson, BJHarden, DGMorgan, DGLodge, NJDworetzky, SIOlson, REMacor, JE Discovery of a novel series of quinolonea7 nicotinic acetylcholine receptor agonists. Bioorg Med Chem Lett 23:1684-8 (2013)  
Target
Name:
Neuronal acetylcholine receptor subunit alpha-7
Synonyms:
ACHA7_RAT Cholinergic, Nicotinic Alpha7 Chrna7 Neuronal acetylcholine receptor (alpha7 nAChR) Neuronal acetylcholine receptor subunit alpha-7 Neuronal acetylcholine receptor subunit alpha-7 (nAChR)
Type:
Enzyme
Mol. Mass.:
56502.44
Organism:
Rattus norvegicus (Rat)
Description:
Q05941
Residue:
502
  
Inhibitor
Name:
BDBM50430247
Synonyms:
CHEMBL2332472
Type:
Small organic molecule
Emp. Form.:
C23H23N3O
Mol. Mass.:
357.4482
SMILES:
O=c1cc(-c2cccc3[nH]ccc23)c2ccccc2n1CC1CCCNC1
: