Target
Rho-associated protein kinase 1
Ligand
BDBM50430377
Substrate
Meas. Tech.
ChEMBL_943815 (CHEMBL2346264)
IC50
1.000000±n/a nM
Citation
 Chowdhury, SChen, YTFang, XGrant, WPocas, JCameron, MDRuiz, CLin, LPark, HSchröter, TBannister, TDLograsso, PVFeng, Y Amino acid derived quinazolines as Rock/PKA inhibitors. Bioorg Med Chem Lett 23:1592-9 (2013)  
Target
Name:
Rho-associated protein kinase 1
Synonyms:
ROCK-I ROCK1_HUMAN Rho-associated protein kinase Rho-associated, coiled-coil-containing protein kinase 1 Rho-kinase (ROCK I) p160 ROCK-1 | p160ROCK
Type:
Serine/threonine-protein kinase
Mol. Mass.:
158156.77
Organism:
Homo sapiens (Human)
Description:
Q13464
Residue:
1354
  
Inhibitor
Name:
BDBM50430377
Synonyms:
CHEMBL2333898
Type:
Small organic molecule
Emp. Form.:
C21H18ClN5O
Mol. Mass.:
391.854
SMILES:
Clc1ccc(cc1)[C@@H]1CNC[C@H]1c1nc2ccc(cc2c(=O)[nH]1)-c1cn[nH]c1
: