Target
Sterol O-acyltransferase 1
Ligand
BDBM50430482
Substrate
Meas. Tech.
ChEMBL_945360 (CHEMBL2341486)
IC50
6000±n/a nM
Citation
 Lee, KCho, SHLee, JHGoo, JLee, SYBoovanahalli, SKYeo, SKLee, SJKim, YKKim, DHChoi, YSong, GY Synthesis of a novel series of 2-alkylthio substituted naphthoquinones as potent acyl-CoA: cholesterol acyltransferase (ACAT) inhibitors. Eur J Med Chem 62:515-25 (2013)  
Target
Name:
Sterol O-acyltransferase 1
Synonyms:
ACACT ACAT Acetyl-CoA acetyltransferase, mitochondrial Acyl-CoA: cholesterol acyltransferase (ACAT) Cholesterol acyltransferase 1 SOAT1 STAT
Type:
Multi-pass membrane protein may form homo- or heterodimers.
Mol. Mass.:
64751.94
Organism:
Homo sapiens (Human)
Description:
P35610
Residue:
550
  
Inhibitor
Name:
BDBM50430482
Synonyms:
CHEMBL2335537
Type:
Small organic molecule
Emp. Form.:
C18H22O2S
Mol. Mass.:
302.431
SMILES:
CCCCCCCCSC1=CC(=O)c2ccccc2C1=O
: