Target
Sterol O-acyltransferase 1
Ligand
BDBM50430502
Substrate
Meas. Tech.
ChEMBL_945360 (CHEMBL2341486)
IC50
>100000±n/a nM
Citation
 Lee, KCho, SHLee, JHGoo, JLee, SYBoovanahalli, SKYeo, SKLee, SJKim, YKKim, DHChoi, YSong, GY Synthesis of a novel series of 2-alkylthio substituted naphthoquinones as potent acyl-CoA: cholesterol acyltransferase (ACAT) inhibitors. Eur J Med Chem 62:515-25 (2013)  
Target
Name:
Sterol O-acyltransferase 1
Synonyms:
ACACT ACAT Acetyl-CoA acetyltransferase, mitochondrial Acyl-CoA: cholesterol acyltransferase (ACAT) Cholesterol acyltransferase 1 SOAT1 STAT
Type:
Multi-pass membrane protein may form homo- or heterodimers.
Mol. Mass.:
64751.94
Organism:
Homo sapiens (Human)
Description:
P35610
Residue:
550
  
Inhibitor
Name:
BDBM50430502
Synonyms:
CHEMBL2335518
Type:
Small organic molecule
Emp. Form.:
C14H14O6S
Mol. Mass.:
310.322
SMILES:
CCS(=O)(=O)C1=CC(=O)c2c(OC)ccc(OC)c2C1=O
: