Target
Phosphatidylinositol 3,4,5-trisphosphate 5-phosphatase 2
Ligand
BDBM50430584
Substrate
Meas. Tech.
ChEMBL_947251 (CHEMBL2343088)
IC50
620±n/a nM
Citation
 Ichihara, YFujimura, RTsuneki, HWada, TOkamoto, KGouda, HHirono, SSugimoto, KMatsuya, YSasaoka, TToyooka, N Rational design and synthesis of 4-substituted 2-pyridin-2-ylamides with inhibitory effects on SH2 domain-containing inositol 5'-phosphatase 2 (SHIP2). Eur J Med Chem 62:649-60 (2013)  
Target
Name:
Phosphatidylinositol 3,4,5-trisphosphate 5-phosphatase 2
Synonyms:
INPPL-1 Inositol polyphosphate phosphatase-like protein 1 Protein 51C SHIP-2 SHIP2_HUMAN | Src homology-2 domain containing protein tyrosine phosphatase-2 (SHP2)
Type:
Enzyme
Mol. Mass.:
138596.65
Organism:
Homo sapiens (Human)
Description:
O15357
Residue:
1258
  
Inhibitor
Name:
BDBM50430584
Synonyms:
CHEMBL2337806
Type:
Small organic molecule
Emp. Form.:
C20H18ClNO2S
Mol. Mass.:
371.88
SMILES:
C[C@H](NC(=O)c1sccc1OCc1ccc(Cl)cc1)c1ccccc1
: