Target
Kappa-type opioid receptor
Ligand
BDBM50354578
Substrate
Meas. Tech.
ChEMBL_947794 (CHEMBL2342213)
IC50
2±n/a nM
Citation
 Greedy, BMBradbury, FThomas, MPGrivas, KCami-Kobeci, GArchambeau, ABosse, KClark, MJAceto, MLewis, JWTraynor, JRHusbands, SM Orvinols with mixed kappa/mu opioid receptor agonist activity. J Med Chem 56:3207-16 (2013)  
Target
Name:
Kappa-type opioid receptor
Synonyms:
Kappa Opioid Receptor OPRK1 Opiate Kappa 1 | mu/kappa opioid receptor
Type:
G Protein-Coupled Receptor (GPCR)
Mol. Mass.:
42744.99
Organism:
Cavia porcellus (domestic guinea pig)
Description:
P41144
Residue:
380
  
Inhibitor
Name:
BDBM50354578
Synonyms:
BUPRENORPHINE US11534436, Compound buprenorphine | US9315514, Buprenorphine
Type:
Small organic molecule
Emp. Form.:
C29H41NO4
Mol. Mass.:
467.6401
SMILES:
CO[C@@]12CC[C@@]3(C[C@@H]1[C@](C)(O)C(C)(C)C)[C@H]1Cc4ccc(O)c5O[C@@H]2[C@]3(CCN1CC1CC1)c45
: