Target
Mu-type opioid receptor
Ligand
BDBM50430587
Substrate
Meas. Tech.
ChEMBL_948258 (CHEMBL2340176)
Ki
0.680000±n/a nM
Citation
 Greedy, BMBradbury, FThomas, MPGrivas, KCami-Kobeci, GArchambeau, ABosse, KClark, MJAceto, MLewis, JWTraynor, JRHusbands, SM Orvinols with mixed kappa/mu opioid receptor agonist activity. J Med Chem 56:3207-16 (2013)  
Target
Name:
Mu-type opioid receptor
Synonyms:
MOR-1 Mu-type opioid receptor (MOR) OPRM_RAT Opioid receptor B Ror-b
Type:
G Protein-Coupled Receptor (GPCR)
Mol. Mass.:
44503.11
Organism:
Rattus norvegicus (rat)
Description:
Competition binding assays were carried out using membrane preparations from transfected HN9.10 cells that constitutively expressed the mu opioid receptor.
Residue:
398
  
Inhibitor
Name:
BDBM50430587
Synonyms:
CHEMBL2338720
Type:
Small organic molecule
Emp. Form.:
C28H39NO4
Mol. Mass.:
453.6136
SMILES:
CO[C@]12CC[C@@]3(C[C@@H]1[C@@H](O)CC(C)C)[C@H]1Cc4ccc(O)c5O[C@@H]2[C@]3(CCN1CC1CC1)c45
: