Target
Kappa-type opioid receptor
Ligand
BDBM50430602
Substrate
Meas. Tech.
ChEMBL_948257 (CHEMBL2340175)
Ki
0.051000±n/a nM
Citation
 Greedy, BMBradbury, FThomas, MPGrivas, KCami-Kobeci, GArchambeau, ABosse, KClark, MJAceto, MLewis, JWTraynor, JRHusbands, SM Orvinols with mixed kappa/mu opioid receptor agonist activity. J Med Chem 56:3207-16 (2013)  
Target
Name:
Kappa-type opioid receptor
Synonyms:
K-OR-1 Kappa-opioid receptor (KOR) Kappa-type opioid receptor (KOR) OPIATE Kappa OPRK1 kappa opioid receptor (KOR)
Type:
G Protein-Coupled Receptor (GPCR)
Mol. Mass.:
42648.76
Organism:
Homo sapiens (Human)
Description:
P41145
Residue:
380
  
Inhibitor
Name:
BDBM50430602
Synonyms:
CHEMBL2338743
Type:
Small organic molecule
Emp. Form.:
C28H39NO4
Mol. Mass.:
453.6136
SMILES:
CO[C@]12CC[C@@]3(C[C@@H]1[C@](C)(O)C(C)C)[C@H]1Cc4ccc(O)c5O[C@@H]2[C@]3(CCN1CC1CC1)c45
: