Target
Aminopeptidase N
Ligand
BDBM50430631
Substrate
Meas. Tech.
ChEMBL_942089 (CHEMBL2340787)
IC50
730±n/a nM
Citation
 Ma, CJin, KCao, JZhang, LLi, XXu, W Novel leucine ureido derivatives as inhibitors of aminopeptidase N (APN). Bioorg Med Chem 21:1621-7 (2013)  
Target
Name:
Aminopeptidase N
Synonyms:
AMPN_HUMAN APN Aminopeptidase CD_antigen=CD13 Myeloid plasma membrane glycoprotein CD13 gp150 | hAPN
Type:
PROTEIN
Mol. Mass.:
109522.63
Organism:
Homo sapiens (Human)
Description:
ChEMBL_1507526
Residue:
967
  
Inhibitor
Name:
BDBM50430631
Synonyms:
CHEMBL2332519
Type:
Small organic molecule
Emp. Form.:
C14H20BrN3O3
Mol. Mass.:
358.231
SMILES:
CC(C)C[C@H](NC(=O)NCc1ccccc1Br)C(=O)NO
: