Target
Aminopeptidase N
Ligand
BDBM50430646
Substrate
Meas. Tech.
ChEMBL_942091 (CHEMBL2340789)
IC50
1660±n/a nM
Citation
 Ma, CJin, KCao, JZhang, LLi, XXu, W Novel leucine ureido derivatives as inhibitors of aminopeptidase N (APN). Bioorg Med Chem 21:1621-7 (2013)  
Target
Name:
Aminopeptidase N
Synonyms:
AMPN_PIG AP-M Alanyl aminopeptidase Aminopeptidase N (APN) Microsomal aminopeptidase pAPN
Type:
Protein
Mol. Mass.:
108810.25
Organism:
Sus scrofa (Pig)
Description:
P15145
Residue:
963
  
Inhibitor
Name:
BDBM50430646
Synonyms:
CHEMBL2332511
Type:
Small organic molecule
Emp. Form.:
C13H18ClN3O3
Mol. Mass.:
299.753
SMILES:
CC(C)C[C@H](NC(=O)Nc1cccc(Cl)c1)C(=O)NO
: