Target
Aldo-keto reductase family 1 member C3
Ligand
BDBM17636
Substrate
Meas. Tech.
ChEMBL_942527 (CHEMBL2346182)
IC50
410±n/a nM
Citation
 Heinrich, DMFlanagan, JUJamieson, SMSilva, SRigoreau, LJTrivier, ERaynham, TTurnbull, APDenny, WA Synthesis and structure-activity relationships for 1-(4-(piperidin-1-ylsulfonyl)phenyl)pyrrolidin-2-ones as novel non-carboxylate inhibitors of the aldo-keto reductase enzyme AKR1C3. Eur J Med Chem 62:738-44 (2013)  
Target
Name:
Aldo-keto reductase family 1 member C3
Synonyms:
17-beta-Hydroxysteroid Dehydrogenase 5 (17-beta-HSD5, AKR1C3) AK1C3_HUMAN Aldo-keto reductase family 1 member C3 Aldo-keto reductase family 1 member C3 (AK1C3a) Aldo-keto-reductase family 1 member C3 Dihydrodiol dehydrogenase 3 Estradiol 17-beta-dehydrogenase KIAA0119 Prostaglandin F synthase Trans-1,2-dihydrobenzene-1,2-diol dehydrogenase
Type:
Enzyme
Mol. Mass.:
36859.86
Organism:
Homo sapiens (Human)
Description:
P42330
Residue:
323
  
Inhibitor
Name:
BDBM17636
Synonyms:
2-{[3-(trifluoromethyl)phenyl]amino}benzoic acid CHEMBL23588 Nichisedan US9271961, Flufenamic Acid
Type:
Small organic molecule
Emp. Form.:
C14H10F3NO2
Mol. Mass.:
281.2299
SMILES:
OC(=O)c1ccccc1Nc1cccc(c1)C(F)(F)F
: