Target
Mu-type opioid receptor
Ligand
BDBM50430804
Substrate
Meas. Tech.
ChEMBL_943430 (CHEMBL2341394)
EC50
0.093300±n/a nM
Citation
 Liu, XWang, YXing, YYu, JJi, HKai, MWang, ZWang, DZhang, YZhao, DWang, R Design, synthesis, and pharmacological characterization of novel endomorphin-1 analogues as extremely potentµ-opioid agonists. J Med Chem 56:3102-14 (2013)  
Target
Name:
Mu-type opioid receptor
Synonyms:
M-OR-1 MOR-1 MUOR1 Mu opiate receptor OPRM1 hMOP | mu-type opioid receptor isoform MOR-1
Type:
G Protein-Coupled Receptor (GPCR)
Mol. Mass.:
44789.51
Organism:
Homo sapiens (Human)
Description:
P35372
Residue:
400
  
Inhibitor
Name:
BDBM50430804
Synonyms:
CHEMBL2334769
Type:
Small organic molecule
Emp. Form.:
C33H36N6O6
Mol. Mass.:
612.6755
SMILES:
N[C@@H](Cc1ccc(O)cc1)C(=O)N1CC[C@@H](C1)C(=O)N[C@@H](Cc1c[nH]c2ccccc12)C(=O)N[C@H](C(=C)C(N)=O)c1ccco1
: