Target
Alpha-ketoglutarate-dependent dioxygenase FTO
Ligand
BDBM92495
Substrate
Meas. Tech.
ChEMBL_947323 (CHEMBL2344107)
IC50
>1000000±n/a nM
Citation
 Aik, WDemetriades, MHamdan, MKBagg, EAYeoh, KKLejeune, CZhang, ZMcDonough, MASchofield, CJ Structural basis for inhibition of the fat mass and obesity associated protein (FTO). J Med Chem 56:3680-8 (2013)  
Target
Name:
Alpha-ketoglutarate-dependent dioxygenase FTO
Synonyms:
FTO Fat mass and obesity-associated protein | KIAA1752
Type:
PROTEIN
Mol. Mass.:
58263.75
Organism:
Homo sapiens (Human)
Description:
ChEMBL_1515854
Residue:
505
  
Inhibitor
Name:
BDBM92495
Synonyms:
Malate
Type:
Small organic molecule
Emp. Form.:
C4H6O5
Mol. Mass.:
134.0874
SMILES:
OC(CC(O)=O)C(O)=O
: