Target
Alpha-ketoglutarate-dependent dioxygenase FTO
Ligand
BDBM50431017
Substrate
Meas. Tech.
ChEMBL_947323 (CHEMBL2344107)
IC50
38000±n/a nM
Citation
 Aik, WDemetriades, MHamdan, MKBagg, EAYeoh, KKLejeune, CZhang, ZMcDonough, MASchofield, CJ Structural basis for inhibition of the fat mass and obesity associated protein (FTO). J Med Chem 56:3680-8 (2013)  
Target
Name:
Alpha-ketoglutarate-dependent dioxygenase FTO
Synonyms:
FTO Fat mass and obesity-associated protein | KIAA1752
Type:
PROTEIN
Mol. Mass.:
58263.75
Organism:
Homo sapiens (Human)
Description:
ChEMBL_1515854
Residue:
505
  
Inhibitor
Name:
BDBM50431017
Synonyms:
CHEMBL2338327
Type:
Small organic molecule
Emp. Form.:
C19H15ClN2O4
Mol. Mass.:
370.786
SMILES:
OC(=O)[C@@H](Cc1ccccc1)NC(=O)c1nc(Cl)c2ccccc2c1O
: