Target
RAF proto-oncogene serine/threonine-protein kinase
Ligand
BDBM50431030
Substrate
Meas. Tech.
ChEMBL_947334 (CHEMBL2344118)
IC50
24000±n/a nM
Citation
 Brown, AShi, QMoore, TWYoon, YPrussia, AMaddox, CLiotta, DCShim, HSnyder, JP Monocarbonyl curcumin analogues: heterocyclic pleiotropic kinase inhibitors that mediate anticancer properties. J Med Chem 56:3456-66 (2013)  
Target
Name:
RAF proto-oncogene serine/threonine-protein kinase
Synonyms:
C-Raf Protein Kinase RAF RAF1 Raf-1 Serine/threonine-protein kinase C-Raf | cRaf
Type:
Serine/threonine-protein kinase
Mol. Mass.:
73082.52
Organism:
Homo sapiens (Human)
Description:
P04049
Residue:
648
  
Inhibitor
Name:
BDBM50431030
Synonyms:
CHEMBL379849
Type:
Small organic molecule
Emp. Form.:
C19H15F2NO
Mol. Mass.:
311.3253
SMILES:
Fc1ccccc1\C=C1/CNC\C(=C/c2ccccc2F)C1=O
: