Target
D-amino-acid oxidase
Ligand
BDBM50431084
Substrate
Meas. Tech.
ChEMBL_947854 (CHEMBL2343130)
IC50
3.8±n/a nM
Citation
 Hondo, TWarizaya, MNiimi, TNamatame, IYamaguchi, TNakanishi, KHamajima, THarada, KSakashita, HMatsumoto, YOrita, MTakeuchi, M 4-Hydroxypyridazin-3(2H)-one derivatives as novel D-amino acid oxidase inhibitors. J Med Chem 56:3582-92 (2013)  
Target
Name:
D-amino-acid oxidase
Synonyms:
D-Amino Acid Oxidase (DAAO) Dao OXDA_RAT
Type:
Homodimer
Mol. Mass.:
38824.91
Organism:
Rattus norvegicus (rat)
Description:
Recombinant rat DAAO expressed and purified from sf9 insect cells, was used in enzyme assays.
Residue:
346
  
Inhibitor
Name:
BDBM50431084
Synonyms:
CHEMBL2338802 | US10202399, Example 14
Type:
Small organic molecule
Emp. Form.:
C13H14N2O3
Mol. Mass.:
246.2619
SMILES:
COc1ccc(CCc2cc(O)c(=O)[nH]n2)cc1
: