Target
D-amino-acid oxidase
Ligand
BDBM50431065
Substrate
Meas. Tech.
ChEMBL_947855 (CHEMBL2343131)
IC50
4.4±n/a nM
Citation
 Hondo, TWarizaya, MNiimi, TNamatame, IYamaguchi, TNakanishi, KHamajima, THarada, KSakashita, HMatsumoto, YOrita, MTakeuchi, M 4-Hydroxypyridazin-3(2H)-one derivatives as novel D-amino acid oxidase inhibitors. J Med Chem 56:3582-92 (2013)  
Target
Name:
D-amino-acid oxidase
Synonyms:
DAAO Dao OXDA_MOUSE
Type:
PROTEIN
Mol. Mass.:
38667.41
Organism:
Mus musculus
Description:
ChEMBL_947855
Residue:
345
  
Inhibitor
Name:
BDBM50431065
Synonyms:
CHEMBL2338799 | US10202399, Example 16
Type:
Small organic molecule
Emp. Form.:
C13H14N2O3
Mol. Mass.:
246.2619
SMILES:
COc1cccc(CCc2cc(O)c(=O)[nH]n2)c1
: