Target
Rho-associated protein kinase 2
Ligand
BDBM50431128
Substrate
Meas. Tech.
ChEMBL_948348 (CHEMBL2341182)
IC50
12±n/a nM
Citation
 Yin, YLin, LRuiz, CKhan, SCameron, MDGrant, WPocas, JEid, NPark, HSchröter, TLograsso, PVFeng, Y Synthesis and biological evaluation of urea derivatives as highly potent and selective rho kinase inhibitors. J Med Chem 56:3568-81 (2013)  
Target
Name:
Rho-associated protein kinase 2
Synonyms:
KIAA0619 ROCK2 Rho kinase 2 (ROCKII) Rho-associated protein kinase 2 (ROCK2) Rho-associated protein kinase 2/Transforming protein RhoA Rho-associated, coiled-coil-containing protein kinase II p164 ROCK-2
Type:
Protein
Mol. Mass.:
160885.43
Organism:
Homo sapiens (Human)
Description:
O75116
Residue:
1388
  
Inhibitor
Name:
BDBM50431128
Synonyms:
CHEMBL2331562
Type:
Small organic molecule
Emp. Form.:
C19H20N4O2
Mol. Mass.:
336.3877
SMILES:
OCCN(Cc1ccccc1)C(=O)Nc1ccc(cc1)-c1cn[nH]c1
: