Target
Rho-associated protein kinase 1
Ligand
BDBM50431138
Substrate
Meas. Tech.
ChEMBL_948342 (CHEMBL2341176)
IC50
4.0±n/a nM
Citation
 Yin, YLin, LRuiz, CKhan, SCameron, MDGrant, WPocas, JEid, NPark, HSchröter, TLograsso, PVFeng, Y Synthesis and biological evaluation of urea derivatives as highly potent and selective rho kinase inhibitors. J Med Chem 56:3568-81 (2013)  
Target
Name:
Rho-associated protein kinase 1
Synonyms:
ROCK-I ROCK1_HUMAN Rho-associated protein kinase Rho-associated, coiled-coil-containing protein kinase 1 Rho-kinase (ROCK I) p160 ROCK-1 | p160ROCK
Type:
Serine/threonine-protein kinase
Mol. Mass.:
158156.77
Organism:
Homo sapiens (Human)
Description:
Q13464
Residue:
1354
  
Inhibitor
Name:
BDBM50431138
Synonyms:
CHEMBL2332097
Type:
Small organic molecule
Emp. Form.:
C19H20N4O2
Mol. Mass.:
336.3877
SMILES:
COc1cccc(CN(C)C(=O)Nc2ccc(cc2)-c2cn[nH]c2)c1
: