Target
Cytochrome P450 2C9
Ligand
BDBM50431134
Substrate
Meas. Tech.
ChEMBL_948336 (CHEMBL2341170)
IC50
30000±n/a nM
Citation
 Yin, YLin, LRuiz, CKhan, SCameron, MDGrant, WPocas, JEid, NPark, HSchröter, TLograsso, PVFeng, Y Synthesis and biological evaluation of urea derivatives as highly potent and selective rho kinase inhibitors. J Med Chem 56:3568-81 (2013)  
Target
Name:
Cytochrome P450 2C9
Synonyms:
(R)-limonene 6-monooxygenase CP2C9_HUMAN CYP2C9 Cytochrome P450 2C9 (CYP2C9 ) P-450MP P450 PB-1 | S-mephenytoin 4-hydroxylase
Type:
Enzyme
Mol. Mass.:
55636.33
Organism:
Homo sapiens (Human)
Description:
P11712
Residue:
490
  
Inhibitor
Name:
BDBM50431134
Synonyms:
CHEMBL2332068
Type:
Small organic molecule
Emp. Form.:
C22H27N5O2
Mol. Mass.:
393.4821
SMILES:
COc1cccc(CN(CCN(C)C)C(=O)Nc2ccc(cc2)-c2cn[nH]c2)c1
: