Target
Serine/threonine-protein kinase MRCK alpha
Ligand
BDBM50431134
Substrate
Meas. Tech.
ChEMBL_948345 (CHEMBL2341179)
IC50
8695±n/a nM
Citation
 Yin, YLin, LRuiz, CKhan, SCameron, MDGrant, WPocas, JEid, NPark, HSchröter, TLograsso, PVFeng, Y Synthesis and biological evaluation of urea derivatives as highly potent and selective rho kinase inhibitors. J Med Chem 56:3568-81 (2013)  
Target
Name:
Serine/threonine-protein kinase MRCK alpha
Synonyms:
CDC42BPA MRCK alpha MRCKA_HUMAN Serine/threonine-protein kinase MRCK alpha | Serine/threonine-protein kinase MRCK-A
Type:
Protien
Mol. Mass.:
197305.74
Organism:
Homo sapiens (Human)
Description:
Q5VT25
Residue:
1732
  
Inhibitor
Name:
BDBM50431134
Synonyms:
CHEMBL2332068
Type:
Small organic molecule
Emp. Form.:
C22H27N5O2
Mol. Mass.:
393.4821
SMILES:
COc1cccc(CN(CCN(C)C)C(=O)Nc2ccc(cc2)-c2cn[nH]c2)c1
: